[Tinyos-help] python

Shyam Sahu jus.kewl at gmail.com
Thu Apr 1 17:02:01 PDT 2010


i have python2.5 installed but still recieve this message.



syam at ubuntu:/opt/tinyos-2.1.0/apps/Blink$ make micaz sim
mkdir -p simbuild/micaz
  placing object files in simbuild/micaz
  writing XML schema to app.xml
  compiling BlinkAppC to object file sim.o
ncc -c -shared -fPIC -o simbuild/micaz/sim.o -g -O0 -tossim
-fnesc-nido-tosnodes=1000 -fnesc-simulate
-fnesc-nido-motenumber=sim_node\(\)   -Wall -Wshadow -Wnesc-all
-target=micaz -fnesc-cfile=simbuild/micaz/app.c -board=micasb
-DDEFINED_TOS_AM_GROUP=0x22 --param max-inline-insns-single=100000
-DIDENT_APPNAME=\"BlinkAppC\" -DIDENT_USERNAME=\"syam\"
-DIDENT_HOSTNAME=\"ubuntu\" -DIDENT_USERHASH=0x4c7b3f0aL
-DIDENT_TIMESTAMP=0x4bb531d5L -DIDENT_UIDHASH=0x82f9169fL
-Wno-nesc-data-race BlinkAppC.nc   -fnesc-dump=components
-fnesc-dump=variables -fnesc-dump=constants -fnesc-dump=typedefs
-fnesc-dump=interfacedefs -fnesc-dump=tags -fnesc-dumpfile=app.xml
  compiling Python support and C libraries into pytossim.o, tossim.o, and
c-support.o
g++ -c  -shared -fPIC -o simbuild/micaz/pytossim.o -g -O0
-DIDENT_APPNAME=\"BlinkAppC\" -DIDENT_USERNAME=\"syam\"
-DIDENT_HOSTNAME=\"ubuntu\" -DIDENT_USERHASH=0x4c7b3f0aL
-DIDENT_TIMESTAMP=0x4bb531d5L -DIDENT_UIDHASH=0x82f9169fL
/opt/tinyos-2.1.0/tos/lib/tossim/tossim_wrap.cxx -I/usr/include/python2.5
-I/opt/tinyos-2.1.0/tos/lib/tossim -DHAVE_CONFIG_H
/opt/tinyos-2.1.0/tos/lib/tossim/tossim_wrap.cxx:26:20: error:* Python.h: No
such file or directory*
/opt/tinyos-2.1.0/tos/lib/tossim/tossim_wrap.cxx:296: error: ISO C++ forbids
declaration of ‘PyObject’ with no type
/opt/tinyos-2.1.0/tos/lib/tossim/tossim_wrap.cxx:296: error: expected ‘;’
before ‘*’ token
/opt/tinyos-2.1.0/tos/lib/tossim/tossim_wrap.cxx:297: error: ‘PyObject’ has
not been declared
/opt/tinyos-2.1.0/tos/lib/tossim/tossim_wrap.cxx:302: error: ‘PyObject_HEAD’
does not name a type
/opt/tinyos-2.1.0/tos/lib/tossim/tossim_wrap.cxx:306: error: expected
initializer before ‘*’ token
/opt/tinyos-2.1.0/tos/lib/tossim/tossim_wrap.cxx:313: error: ‘FILE’ has not
been declared
/opt/tinyos-2.1.0/tos/lib/tossim/tossim_wrap.cxx: In function ‘int
swig_varlink_print(swig_varlinkobject*, int*, int)’:
/opt/tinyos-2.1.0/tos/lib/tossim/tossim_wrap.cxx:316: error: ‘fprintf’ was
not declared in this scope
/opt/tinyos-2.1.0/tos/lib/tossim/tossim_wrap.cxx:317: error: ‘struct
swig_varlinkobject’ has no member named ‘vars’
/opt/tinyos-2.1.0/tos/lib/tossim/tossim_wrap.cxx: At global scope:
/opt/tinyos-2.1.0/tos/lib/tossim/tossim_wrap.cxx:325: error: expected
initializer before ‘*’ token
/opt/tinyos-2.1.0/tos/lib/tossim/tossim_wrap.cxx:3496: error: expected ‘}’
at end of input
make: *** [sim-exe] Error 1

where can i find the header file??

-- 
Syam
-------------- next part --------------
An HTML attachment was scrubbed...
URL: https://www.millennium.berkeley.edu/pipermail/tinyos-help/attachments/20100401/82430d5b/attachment.htm 


More information about the Tinyos-help mailing list